{"text_format":"1","workbook":"xlsx","n_sheets":6,"sheets":["Instructions","Overview","Startup Costs","Study Management Costs","Patient Costs","Data Validation"],"not_rendered":{"charts":0,"images":0,"macros":1,"external_links":0,"defined_names":0,"comments":0,"pivot_tables":0},"unopened":[],"bounds":{"document_bytes":16777216,"sheet_cells":100000,"rows_first":2000,"rows_last":500,"rows_between":2000,"halvings":0,"cell_chars":16384,"cell_head_chars":4096},"cells_cut":0,"cells_raw":0,"read":"whole","date_system":"1900"}

{"sheet":"Instructions","index":0,"n_rows":27,"n_cols":13,"rows_kept":27,"cut":false,"hidden":false,"merged":[[0,0,0,9],[1,0,1,12],[2,0,2,12],[4,0,4,12],[6,0,6,12],[26,0,26,12],[12,0,12,12],[14,0,14,12],[15,0,15,12],[16,0,16,12],[17,0,17,12],[19,0,19,12],[22,0,22,12],[20,0,20,12],[21,0,21,12],[23,0,23,12],[24,0,24,12],[25,0,25,12],[5,0,5,12],[13,0,13,12],[8,0,8,12],[9,0,9,12],[10,0,10,12],[11,0,11,12],[18,0,18,12],[7,0,7,12]]}
[null,null,null,null,null,null,null,null,null,null,null,null,"Version Date: 06-MAR-2023"]
["School of Medicine Office of Grants and Contracts (SOMOGC)\nSalary Over the Cap (SOC) Costing Allocation Template\nUser Instructions"]
["Clinical Trial Budget Template"]
[]
["• \"Overview\":"]
["   □ Enter the administrative details about the clinical trial in cells I3-I16. The indirect cost (IDC) rate entered in I5 will be used to calculate the IDC for all tabs. "]
["   □ In cell F17, enter the total number of patients you plan to enroll in this clinical trial. This number will be the multipler used to determine the total patient costs (F18)."]
["• \"Data Validation\":"]
["   □ Enter all of the clinical trial roles and their hourly pay rate in the \"Personnel\" table (A4:B23)."]
["   □ Enter the non-personnel startup costs and their prices in the \"Startup Costs - Other Cost\" table (A26:B42)."]
["   □ Etner study management costs and their prices in the \"Study Management Costs\" table (D4:E35)."]
["   □ Enter procedures and their associated negotiated price, research cost, UPG fee, and sponsor rate in the \"Procedures\" table (G4:L49)."]
["• \"Startup Costs\":"]
["   □ Enter the names of the personnel committing time/effort for \"Study Meeting Costs & Setup,\" (B7:B14) \"IRB and GCRC Submission and Setup,\" (B19:B26) and \"Budget and Contract Costs and Setup\" (B31:B38)."]
["   □ In cells C7:C14/C19:C26/C31:C38 choose the role from the dropdown menu for each name you have listed; these options are populated from the \"Personnel\" table on the \"Data Validation\" tab and the hourly rate for those roles will auto-populate in cells D7:D14/D19:D26/D31:D38."]
["   □ In cells E7:E14/E19:E26/E31:E38 enter the number of hours for each person."]
["   □ In cells B44:B58 select non-personnel startup costs from the dropdown menu; these options are populated from the \"Startup Costs - Other Costs\" table on the \"Data Validation\" tab."]
["• \"Study Management Costs\""]
["   □ In cells B8:B26 select study management fees from the dropdown menu; these options are populated from the \"Study Mangement Costs\" table on the \"Data Validation\" tab."]
["   □ In cells D8:D26 enter the quantity of each study management fee across the entire clinical trial project period."]
{"$rows_left_out":8}
{"sheet":"Overview","index":1,"n_rows":22,"n_cols":8,"rows_kept":22,"cut":false,"hidden":false,"merged":[[0,1,0,5],[2,1,2,5],[8,1,8,5],[1,1,1,5],[10,1,10,4],[11,1,11,5],[9,1,9,5],[3,1,3,4],[4,1,4,4],[5,1,5,4],[6,1,6,4],[7,1,7,4],[19,1,19,4],[21,1,21,4],[12,1,12,5],[13,1,13,4],[14,1,14,4],[17,1,17,4],[15,1,15,4],[16,1,16,4],[2,8,2,13],[3,8,3,13],[4,8,4,13],[5,8,5,13],[6,8,6,13],[12,8,12,13],[13,8,13,13],[14,8,14,13],[15,8,15,13],[7,8,7,13],[8,8,8,13],[9,8,9,13],[10,8,10,13],[11,8,11,13]]}
[null,"BUDGET OVERVIEW FOR ENTIRE CLINICAL TRIAL"]
[]
[null,"STARTUP COSTS",null,null,null,null,null,"Principal Investigator"]
[null,"Subtotal - Study Meetings",null,null,null,{"$f":"'Startup Costs'!F15","v":0},null,"Study Title"]
[null,"Subtotal - IRB & GCRC Submission",null,null,null,{"$f":"'Startup Costs'!F27","v":0},null,"IDC Rate (%)"]
[null,"Subtotal - Budget and Contract",null,null,null,{"$f":"'Startup Costs'!F39","v":0},null,"Study IRB#"]
[null,"Subtotal - Other Costs",null,null,null,{"$f":"'Startup Costs'!F59","v":0},null,"Study Phase"]
[null,"Total Startup Costs",null,null,null,{"$f":"'Startup Costs'!F61","v":0},null,"Study Type"]
[null,null,null,null,null,null,null,"Therapeutic Agent Class"]
[null,"STUDY MANAGEMENT COSTS",null,null,null,null,null,"Randomized vs Open-Label"]
[null,"Total Study Management & Site Costs",null,null,null,{"$f":"'Study Management Costs'!E27","v":0},null,"Study Arm # (out of X)"]
[null,null,null,null,null,null,null,"Mode of Study Agent Treatment"]
[null,"PATIENT COSTS",null,null,null,null,null,"Cycle Length"]
[null,"Subtotal - Per Patient Procedure Costs",null,null,null,{"$f":"'Patient Costs'!AF49","v":0},null,"Total # Study Drug Treatments"]
[null,"Subtotal - Per Patient Non-Procedure Costs",null,null,null,{"$f":"'Patient Costs'!AF101","v":0},null,"Study Duration"]
[null,"Total Per Patient Costs",null,null,null,{"$f":"Overview!F14+Overview!F15","v":0},null,"Maximum # Study Visits"]
[null,"# of Patients"]
[null,"Total Patient Costs",null,null,null,{"$f":"F16*F17","v":0}]
[]
[null,"Institutional Overhead",null,null,null,{"$f":"(F8+F11+F18)*I5","v":0}]
{"$rows_left_out":3}
{"sheet":"Startup Costs","index":2,"n_rows":65,"n_cols":6,"rows_kept":65,"cut":false,"hidden":false,"merged":[[0,1,0,5],[64,1,64,4],[63,1,63,5],[4,1,4,5],[15,1,15,5],[28,1,28,5],[59,1,59,5],[60,1,60,4],[62,1,62,4],[61,1,61,5],[55,1,55,2],[56,1,56,2],[57,1,57,2],[58,1,58,4],[41,1,41,5],[45,1,45,2],[46,1,46,2],[47,1,47,2],[48,1,48,2],[54,1,54,2],[49,1,49,2],[53,1,53,2],[50,1,50,2],[51,1,51,2],[52,1,52,2],[1,2,1,5],[2,2,2,5],[42,1,42,4],[43,1,43,2],[44,1,44,2],[14,1,14,4],[39,1,39,5],[40,1,40,3],[16,1,16,5],[26,1,26,4],[27,1,27,5],[38,1,38,4]]}
[null,"STARTUP COSTS"]
[null,{"$f":"\"Principal Investigator: \"","v":"Principal Investigator: "},{"$f":"IF(Overview!I3=\"\",\"\",Overview!I3)","v":""}]
[null,"Project Title:",{"$f":"IF(Overview!I4=\"\",\"\",Overview!I4)","v":""}]
[]
[null,"Study Meetings Costs & Setup"]
[null,"Name","Title / Rate Designation","Hourly \nRate","Hours","Total \nCost"]
[null,null,null,{"$f":"IFERROR(VLOOKUP('Startup Costs'!$C7,'Data Validation'!$A$5:$B$23,2,FALSE),\"\")","v":""},null,{"$f":"IFERROR(D7*E7,\"\")","v":""}]
[null,null,null,{"$f":"IFERROR(VLOOKUP('Startup Costs'!$C8,'Data Validation'!$A$5:$B$23,2,FALSE),\"\")","v":""},null,{"$f":"IFERROR(D8*E8,\"\")","v":""}]
[null,null,null,{"$f":"IFERROR(VLOOKUP('Startup Costs'!$C9,'Data Validation'!$A$5:$B$23,2,FALSE),\"\")","v":""},null,""]
[null,null,null,{"$f":"IFERROR(VLOOKUP('Startup Costs'!$C10,'Data Validation'!$A$5:$B$23,2,FALSE),\"\")","v":""},null,""]
[null,null,null,{"$f":"IFERROR(VLOOKUP('Startup Costs'!$C11,'Data Validation'!$A$5:$B$23,2,FALSE),\"\")","v":""},null,""]
[null,null,null,{"$f":"IFERROR(VLOOKUP('Startup Costs'!$C12,'Data Validation'!$A$5:$B$23,2,FALSE),\"\")","v":""},null,""]
[null,null,null,{"$f":"IFERROR(VLOOKUP('Startup Costs'!$C13,'Data Validation'!$A$5:$B$23,2,FALSE),\"\")","v":""},null,""]
[null,null,null,{"$f":"IFERROR(VLOOKUP('Startup Costs'!$C14,'Data Validation'!$A$5:$B$23,2,FALSE),\"\")","v":""},null,""]
[null,"Subtotal Study Meetings:",null,null,null,{"$f":"SUM(F7:F14)","v":0}]
[]
[null,"IRB and GCRC Submission & Setup"]
[null,"Name","Title / Rate Designation","Hourly \nRate","Hours","Total \nCost"]
[null,null,null,{"$f":"IFERROR(VLOOKUP('Startup Costs'!$C19,'Data Validation'!$A$5:$B$23,2,FALSE),\"\")","v":""},null,{"$f":"IFERROR(D19*E19,\"\")","v":""}]
[null,null,null,{"$f":"IFERROR(VLOOKUP('Startup Costs'!$C20,'Data Validation'!$A$5:$B$23,2,FALSE),\"\")","v":""},null,{"$f":"IFERROR(D20*E20,\"\")","v":""}]
{"$rows_left_out":46}
{"sheet":"Study Management Costs","index":3,"n_rows":33,"n_cols":5,"rows_kept":33,"cut":false,"hidden":false,"merged":[[27,1,27,4],[29,1,29,4],[0,1,0,4],[5,1,5,4],[26,1,26,3],[1,2,1,4],[2,2,2,4],[3,1,3,2],[28,1,28,3]]}
[null,"STUDY MANAGEMENT COSTS"]
[null,"Principal Investigator:",{"$f":"IF(Overview!I3=\"\",\"\",Overview!I3)","v":""}]
[null,"Project Title:",{"$f":"IF(Overview!I4=\"\",\"\",Overview!I4)","v":""}]
[null,null,null,"IDC Rate (%):",{"$f":"IF(Overview!I5=\"\",\"\",Overview!I5)","v":""}]
[]
[null,"Study Management Costs"]
[null,"Study Management Fees","Rate","Quantity","Total \nCost*"]
[null,null,{"$f":"IFERROR(VLOOKUP('Study Management Costs'!$B8,'Data Validation'!$D$5:$E$35,2,FALSE),\"\")","v":""},null,{"$f":"IFERROR(C8*D8,\"\")","v":""}]
[null,null,{"$f":"IFERROR(VLOOKUP('Study Management Costs'!$B9,'Data Validation'!$D$5:$E$35,2,FALSE),\"\")","v":""},null,{"$f":"IFERROR(C9*D9,\"\")","v":""}]
[null,null,{"$f":"IFERROR(VLOOKUP('Study Management Costs'!$B10,'Data Validation'!$D$5:$E$35,2,FALSE),\"\")","v":""},null,""]
[null,null,{"$f":"IFERROR(VLOOKUP('Study Management Costs'!$B11,'Data Validation'!$D$5:$E$35,2,FALSE),\"\")","v":""},null,""]
[null,null,{"$f":"IFERROR(VLOOKUP('Study Management Costs'!$B12,'Data Validation'!$D$5:$E$35,2,FALSE),\"\")","v":""},null,""]
[null,null,{"$f":"IFERROR(VLOOKUP('Study Management Costs'!$B13,'Data Validation'!$D$5:$E$35,2,FALSE),\"\")","v":""},null,""]
[null,null,{"$f":"IFERROR(VLOOKUP('Study Management Costs'!$B14,'Data Validation'!$D$5:$E$35,2,FALSE),\"\")","v":""},null,""]
[null,null,{"$f":"IFERROR(VLOOKUP('Study Management Costs'!$B15,'Data Validation'!$D$5:$E$35,2,FALSE),\"\")","v":""},null,""]
[null,null,{"$f":"IFERROR(VLOOKUP('Study Management Costs'!$B16,'Data Validation'!$D$5:$E$35,2,FALSE),\"\")","v":""},null,""]
[null,null,{"$f":"IFERROR(VLOOKUP('Study Management Costs'!$B17,'Data Validation'!$D$5:$E$35,2,FALSE),\"\")","v":""},null,""]
[null,null,{"$f":"IFERROR(VLOOKUP('Study Management Costs'!$B18,'Data Validation'!$D$5:$E$35,2,FALSE),\"\")","v":""},null,""]
[null,null,{"$f":"IFERROR(VLOOKUP('Study Management Costs'!$B19,'Data Validation'!$D$5:$E$35,2,FALSE),\"\")","v":""},null,""]
[null,null,{"$f":"IFERROR(VLOOKUP('Study Management Costs'!$B20,'Data Validation'!$D$5:$E$35,2,FALSE),\"\")","v":""},null,""]
{"$rows_left_out":14}
{"sheet":"Patient Costs","index":4,"n_rows":107,"n_cols":32,"rows_kept":107,"cut":false,"hidden":false,"merged":[[0,0,0,4],[1,1,1,4],[2,1,2,4],[6,2,6,3],[3,1,3,2]]}
["PATIENT COSTS",null,null,null,null,null,null,"Visit 1","Visit 2","Visit 3","Visit 4","Visit 5","Visit 6","Visit 7","Visit 8","Visit 9","Visit 10","Visit 11","Visit 12","Visit 13","Visit 14","Visit 15","Visit 16","Visit 17","Visit 18","Visit 19","Visit 20","Visit 21","Visit 22","Visit 23","Visit 24"]
["Principal Investigator:",{"$f":"IF(Overview!I3=\"\",\"\",Overview!I3)","v":""}]
["Project Title:",{"$f":"IF(Overview!I4=\"\",\"\",Overview!I4)","v":""},null,null,null,null,"Procedures",null,null,null,null,null,null,null,null,null,null,"Visit 11","Visit 12","Visit 13","Visit 14","Visit 15","Visit 16","Visit 17","Visit 18","Visit 19","Visit 20","Visit 21","Visit 22","Visit 23","Visit 24","TOTAL"]
[null,null,null,"IDC Rate (%)",{"$f":"IF(Overview!I5=\"\",\"\",Overview!I5)","v":""},null,{"$f":"'Data Validation'!$G5","v":"[INSERT PROCEDURE #1]"},null,null,null,null,null,null,null,null,null,null,null,null,null,null,null,null,null,null,null,null,null,null,null,null,{"$f":"'Data Validation'!$H5*SUMPRODUCT(LEN($H4:$AE4)-LEN(SUBSTITUTE($H4:$AE4,\"X\",\"\")))","v":0}]
[null,null,null,null,null,null,{"$f":"'Data Validation'!$G6","v":"[INSERT PROCEDURE #2]"},null,null,null,null,null,null,null,null,null,null,null,null,null,null,null,null,null,null,null,null,null,null,null,null,{"$f":"'Data Validation'!$H6*SUMPRODUCT(LEN($H5:$AE5)-LEN(SUBSTITUTE($H5:$AE5,\"X\",\"\")))","v":0}]
[null,null,null,null,null,null,{"$f":"'Data Validation'!$G7","v":"[INSERT PROCEDURE #3]"},null,null,null,null,null,null,null,null,null,null,null,null,null,null,null,null,null,null,null,null,null,null,null,null,{"$f":"'Data Validation'!$H7*SUMPRODUCT(LEN($H6:$AE6)-LEN(SUBSTITUTE($H6:$AE6,\"X\",\"\")))","v":0}]
[null,null,"Add/Remove Visits",null,null,null,{"$f":"'Data Validation'!$G8","v":"[INSERT PROCEDURE #4]"},null,null,null,null,null,null,null,null,null,null,null,null,null,null,null,null,null,null,null,null,null,null,null,null,{"$f":"'Data Validation'!$H8*SUMPRODUCT(LEN($H7:$AE7)-LEN(SUBSTITUTE($H7:$AE7,\"X\",\"\")))","v":0}]
[null,null,null,null,null,null,{"$f":"'Data Validation'!$G9","v":"[INSERT PROCEDURE #5]"},null,null,null,null,null,null,null,null,null,null,null,null,null,null,null,null,null,null,null,null,null,null,null,null,{"$f":"'Data Validation'!$H9*SUMPRODUCT(LEN($H8:$AE8)-LEN(SUBSTITUTE($H8:$AE8,\"X\",\"\")))","v":0}]
[null,null,null,null,null,null,{"$f":"'Data Validation'!$G10","v":"[INSERT PROCEDURE #6]"},null,null,null,null,null,null,null,null,null,null,null,null,null,null,null,null,null,null,null,null,null,null,null,null,{"$f":"'Data Validation'!$H10*SUMPRODUCT(LEN($H9:$AE9)-LEN(SUBSTITUTE($H9:$AE9,\"X\",\"\")))","v":0}]
[null,null,null,null,null,null,{"$f":"'Data Validation'!$G11","v":"[INSERT PROCEDURE #7]"},null,null,null,null,null,null,null,null,null,null,null,null,null,null,null,null,null,null,null,null,null,null,null,null,{"$f":"'Data Validation'!$H11*SUMPRODUCT(LEN($H10:$AE10)-LEN(SUBSTITUTE($H10:$AE10,\"X\",\"\")))","v":0}]
[null,null,null,null,null,null,{"$f":"'Data Validation'!$G12","v":"[INSERT PROCEDURE #8]"},null,null,null,null,null,null,null,null,null,null,null,null,null,null,null,null,null,null,null,null,null,null,null,null,{"$f":"'Data Validation'!$H12*SUMPRODUCT(LEN($H11:$AE11)-LEN(SUBSTITUTE($H11:$AE11,\"X\",\"\")))","v":0}]
[null,null,null,null,null,null,{"$f":"'Data Validation'!$G13","v":"[INSERT PROCEDURE #9]"},null,null,null,null,null,null,null,null,null,null,null,null,null,null,null,null,null,null,null,null,null,null,null,null,{"$f":"'Data Validation'!$H13*SUMPRODUCT(LEN($H12:$AE12)-LEN(SUBSTITUTE($H12:$AE12,\"X\",\"\")))","v":0}]
[null,null,null,null,null,null,{"$f":"'Data Validation'!$G14","v":"[INSERT PROCEDURE #10]"},null,null,null,null,null,null,null,null,null,null,null,null,null,null,null,null,null,null,null,null,null,null,null,null,{"$f":"'Data Validation'!$H14*SUMPRODUCT(LEN($H13:$AE13)-LEN(SUBSTITUTE($H13:$AE13,\"X\",\"\")))","v":0}]
[null,null,null,null,null,null,{"$f":"'Data Validation'!$G15","v":"[INSERT PROCEDURE #10]"},null,null,null,null,null,null,null,null,null,null,null,null,null,null,null,null,null,null,null,null,null,null,null,null,{"$f":"'Data Validation'!$H15*SUMPRODUCT(LEN($H14:$AE14)-LEN(SUBSTITUTE($H14:$AE14,\"X\",\"\")))","v":0}]
[null,null,null,null,null,null,{"$f":"'Data Validation'!$G16","v":"[INSERT PROCEDURE #12]"},null,null,null,null,null,null,null,null,null,null,null,null,null,null,null,null,null,null,null,null,null,null,null,null,{"$f":"'Data Validation'!$H16*SUMPRODUCT(LEN($H15:$AE15)-LEN(SUBSTITUTE($H15:$AE15,\"X\",\"\")))","v":0}]
[null,null,null,null,null,null,{"$f":"'Data Validation'!$G17","v":"[INSERT PROCEDURE #13]"},null,null,null,null,null,null,null,null,null,null,null,null,null,null,null,null,null,null,null,null,null,null,null,null,{"$f":"'Data Validation'!$H17*SUMPRODUCT(LEN($H16:$AE16)-LEN(SUBSTITUTE($H16:$AE16,\"X\",\"\")))","v":0}]
[null,null,null,null,null,null,{"$f":"'Data Validation'!$G18","v":"[INSERT PROCEDURE #14]"},null,null,null,null,null,null,null,null,null,null,null,null,null,null,null,null,null,null,null,null,null,null,null,null,{"$f":"'Data Validation'!$H18*SUMPRODUCT(LEN($H17:$AE17)-LEN(SUBSTITUTE($H17:$AE17,\"X\",\"\")))","v":0}]
[null,null,null,null,null,null,{"$f":"'Data Validation'!$G19","v":"[INSERT PROCEDURE #15]"},null,null,null,null,null,null,null,null,null,null,null,null,null,null,null,null,null,null,null,null,null,null,null,null,{"$f":"'Data Validation'!$H19*SUMPRODUCT(LEN($H18:$AE18)-LEN(SUBSTITUTE($H18:$AE18,\"X\",\"\")))","v":0}]
[null,null,null,null,null,null,{"$f":"'Data Validation'!$G20","v":"[INSERT PROCEDURE #16]"},null,null,null,null,null,null,null,null,null,null,null,null,null,null,null,null,null,null,null,null,null,null,null,null,{"$f":"'Data Validation'!$H20*SUMPRODUCT(LEN($H19:$AE19)-LEN(SUBSTITUTE($H19:$AE19,\"X\",\"\")))","v":0}]
[null,null,null,null,null,null,{"$f":"'Data Validation'!$G21","v":"[INSERT PROCEDURE #17]"},null,null,null,null,null,null,null,null,null,null,null,null,null,null,null,null,null,null,null,null,null,null,null,null,{"$f":"'Data Validation'!$H21*SUMPRODUCT(LEN($H20:$AE20)-LEN(SUBSTITUTE($H20:$AE20,\"X\",\"\")))","v":0}]
{"$rows_left_out":88}
{"sheet":"Data Validation","index":5,"n_rows":49,"n_cols":13,"rows_kept":49,"cut":false,"hidden":false,"merged":[[0,6,0,9],[0,0,0,1]]}
["*Does not include institutional overhead",null,null,null,null,null,"Use the link below to search for the research cost and UPG fee for any CPT code"]
[null,null,null,null,null,null,"https://apps.med.virginia.edu/gpr?wfguid=3A1F9E45-47C3-4CDB-8D76-650F6E4BCEC3 ",null,null,null,null,null," *Feeds into \"Patient Costs\" tab"]
[]
["Personnel","Hourly Rate",null,"Study Management Costs","Cost",null,"Procedure","Negotiated Price*","Research Cost","UPG Fee","Sponsor Rate","Variance"]
["Principal Investigator I",0,null,"Annual Maintenance Fee",0,null,"[INSERT PROCEDURE #1]",0,0,0,0,{"$f":"($I5+$J5)-$K5","v":0}]
["Principal Investigator II",0,null,"Annual Pharmacy Maintenance Fee",0,null,"[INSERT PROCEDURE #2]",0,0,0,0,{"$f":"($I6+$J6)-$K6","v":0}]
["Principal Investigator III",0,null,"Study Close Out Fee",0,null,"[INSERT PROCEDURE #3]",0,0,0,0,0]
["Principal Investigator IV",0,null,"Pharmacy Close Out Fee",0,null,"[INSERT PROCEDURE #4]",0,0,0,0,0]
["Principal Investigator V",0,null,"IRB Annual Renewal Fee - Doc Prep Fee",0,null,"[INSERT PROCEDURE #5]",0,0,0,0,0]
["CRC I",0,null,"Protocol Amendment Fee - Doc Prep Fee",0,null,"[INSERT PROCEDURE #6]",0,0,0,0,0]
["CRC II",0,null,"Document Storage (Record Retention)",0,null,"[INSERT PROCEDURE #7]",0,0,0,0,0]
["CRC III",0,null,"IND Safety Report (ea)",0,null,"[INSERT PROCEDURE #8]",0,0,0,0,0]
["Admin Asst",0,null,"Serious Adverse Event",0,null,"[INSERT PROCEDURE #9]",0,0,0,0,0]
["[INSERT PERSONNEL #1]",0,null,"Hotel",0,null,"[INSERT PROCEDURE #10]",0,0,0,0,0]
["[INSERT PERSONNEL #2]",0,null,"Conference Calls",0,null,"[INSERT PROCEDURE #10]",0,0,0,0,0]
["[INSERT PERSONNEL #3]",0,null,"Initiation Visit",0,null,"[INSERT PROCEDURE #12]",0,0,0,0,0]
["[INSERT PERSONNEL #4]",0,null,"Interim Monitoring Visits",0,null,"[INSERT PROCEDURE #13]",0,0,0,0,0]
["[INSERT PERSONNEL #5]",0,null,"Shipping",0,null,"[INSERT PROCEDURE #14]",0,0,0,0,0]
["[INSERT PERSONNEL #6]",0,null,"Mileage",0,null,"[INSERT PROCEDURE #15]",0,0,0,0,0]
["[INSERT PERSONNEL #7]",0,null,"Stipend/Subject Reimbursement",0,null,"[INSERT PROCEDURE #16]",0,0,0,0,0]
{"$rows_left_out":29}