{"text_format":"1","workbook":"xlsx","n_sheets":14,"sheets":["Instructions for Use","UVA Overview","UVA Personnel","Sub01","Sub02","Sub03","Sub04","Sub05","Sub06","Sub07","Sub08","Sub09","Sub10","Sub Formulas"],"not_rendered":{"charts":0,"images":3,"macros":1,"external_links":0,"defined_names":3,"comments":0,"pivot_tables":0},"unopened":[],"bounds":{"document_bytes":16777216,"sheet_cells":100000,"rows_first":2000,"rows_last":500,"rows_between":2000,"halvings":0,"cell_chars":16384,"cell_head_chars":4096},"cells_cut":0,"cells_raw":0,"read":"whole","date_system":"1900"}

{"sheet":"Instructions for Use","index":0,"n_rows":41,"n_cols":13,"rows_kept":41,"cut":false,"hidden":false,"merged":[[40,0,40,12],[20,0,20,12],[36,0,36,12],[6,0,6,12],[29,0,29,12],[31,0,31,12],[32,0,32,12],[33,0,33,12],[22,0,22,12],[23,0,23,12],[26,0,26,12],[27,0,27,12],[28,0,28,12],[7,0,7,12],[12,0,12,12],[13,0,13,12],[14,0,14,12],[10,0,10,12],[0,0,0,9],[1,0,1,12],[3,0,3,12],[11,0,11,12],[4,0,4,12],[5,0,5,12],[37,0,37,12],[38,0,38,12],[39,0,39,12],[15,0,15,12],[17,0,17,12],[18,0,18,12],[19,0,19,12],[21,0,21,12],[16,0,16,12],[30,0,30,12]]}
[null,null,null,null,null,null,null,null,null,null,null,null,"Version Date: 06/05/2023"]
["School of Medicine's Office of Grants and Contracts (SOMOGC) - RPPR/Progress Report Budget Workbook\nUser Instructions"]
[]
["• The SOMOGC RPPR/Progress Report Budget Workbook has two main sheets:\n\n"]
["– \"UVA Overview\" which contains all direct and indirect costs for subsequent budget period; and"]
["– \"UVA Personnel\" which allows the user to input salary support details for all personnel listed on the awarded grant for the subsequent budget period."]
["• Most cells in the budget workbook are locked, however, the sections that require user input are highlighted in blue."]
["• Please be patient when clicking on buttons in this workbook as it contains multiple macros and formulas so there may be some lag on occasion."]
[]
["UVA Overview Worksheet"]
["• Before inputing any data, please click on the orange button in the top left labeled, \"CLICK TO EDIT\".  [You may also need to click \"Edit Content\" in the yellow ribbon along the top of the worksheet when Excel opens the workbook for the first time.]"]
["• Insert the Prinicipal Investigator/Program Director (PI/PD) name in cell B1, award title in cell B2, upcoming grant year (e.g., 1) in cell C3,  Oracle Project/Award #s (123456/GB12345) in cell E3, and the subsequent budget period start and end dates in cells C4 and E4, respectively."]
["• The \"UVA Personnel\" section is divided into Senior/Key and Other Personnel. This section shows the subtotals for both personnel types which are pulled from the \"UVA Personnel\" worksheet."]
["• The Other Than Personnel Services (OTPS) section has collapsible groups for \"Equipment,\" \"Travel,\" \"Materials & Supplies,\" and \"Consultant Services\" so that you can itemize these project costs for greater detail. "]
["• In the area to the left of the row numbers, click on       to expand and      to collapse the grouped rows above the icons. When a grouped row is collapsed the remaining visible row will show the subtotal for that cost category."]
{"$rows_left_out":27}
{"sheet":"UVA Overview","index":1,"n_rows":87,"n_cols":8,"rows_kept":87,"cut":false,"hidden":false,"merged":[[84,0,84,3],[0,6,0,7],[4,0,5,4],[1,1,1,4],[2,0,3,0],[0,1,0,4]]}
["Principal Investigator/Program Director:",null,null,null,null,null,"NOTE: If your award has a specific F&A rate, please fill it in in the blue box below marked \"Other\""]
["Award Title:",null,null,null,null,null,"F&A Description","F&A Rates"]
[null,"Grant Year:",null,"GR#:",null,null,"Off-Grounds",0.26]
[null,"Budget Period Start Date:",null,"Budget Period End Date:",null,null,"Other Sponsored Activities",0.38]
["RESEARCH & RELATED BUDGET\nFOR NEXT REPORTING PERIOD ",null,null,null,null,null,"Instruction",0.56000000000000005]
[null,null,null,null,null,null,"On-Grounds",0.61499999999999999]
[null,null,null,null,{"$f":"\"YEAR \"&C3","v":"YEAR "},null,"Other #1",0]
["UVA Senior/Key Personnel",null,null,null,{"$f":"SUMIF('UVA Personnel'!B8:B22,\"X\",'UVA Personnel'!Q8:Q22)","v":0},null,"Other #2",0]
["UVA Other Personnel",null,null,null,{"$f":"SUMIF('UVA Personnel'!C8:C22,\"X\",'UVA Personnel'!Q8:Q22)","v":0},null,"Other #3",0]
["Subtotal UVA Personnel",null,null,null,{"$f":"ROUND(SUM(E8:E9),0)","v":0}]
["Capital Equipment*",null,null,null,{"$f":"ROUND(SUM(E12:E16),0)","v":0},null,"NOTES"]
["[INSERT EQUIPMENT ITEM]",null,null,null,0]
["[INSERT EQUIPMENT ITEM]",null,null,null,0]
["[INSERT EQUIPMENT ITEM]",null,null,null,0]
["[INSERT EQUIPMENT ITEM]",null,null,null,0]
{"$rows_left_out":73}
{"sheet":"UVA Personnel","index":2,"n_rows":23,"n_cols":30,"rows_kept":23,"cut":false,"hidden":false,"merged":[[5,6,6,6],[4,10,4,12],[5,7,6,7],[4,1,4,2],[0,4,0,13],[0,14,0,16],[5,11,6,11],[5,13,6,13],[2,16,3,16],[2,0,3,13],[0,0,0,3],[5,15,6,15],[5,3,6,3],[5,16,6,16],[5,1,6,1],[5,2,6,2],[5,10,6,10],[5,4,6,4],[5,5,6,5],[4,29,4,30],[22,0,22,8],[6,26,6,27],[4,14,4,16],[5,14,6,14],[5,12,6,12],[5,17,6,17],[5,18,6,18],[5,19,6,19],[5,21,6,21],[4,4,4,9],[5,20,6,20],[5,8,6,8],[5,0,6,0],[5,9,6,9]]}
["UVA Principal Investigator/Program Director:",null,null,null,{"$f":"IF('UVA Overview'!$B$1=\"\",\"\",'UVA Overview'!$B$1)","v":""},null,null,null,null,null,null,null,null,null,"**Note**  BLUE boxes require user input"]
[]
[{"$f":"\"DETAILED BUDGET PERIOD - YEAR \"&'UVA Overview'!C3","v":"DETAILED BUDGET PERIOD - YEAR "},null,null,null,null,null,null,null,null,null,null,null,null,null,"FROM","THROUGH",{"$f":"\"YEAR \"&'UVA Overview'!C3","v":"YEAR "},null,null,null,null,null,null,null,7.0000000000000007E-2]
[null,null,null,null,null,null,null,null,null,null,null,null,null,null,{"$f":"IF('UVA Overview'!C4=\"\",\"\",'UVA Overview'!C4)","v":""},{"$f":"IF('UVA Overview'!E4=\"\",\"\",'UVA Overview'!E4)","v":""},null,null,null,null,null,null,null,null,0]
["PERSONNEL (Applicant Organization Only)","Put an X below on each line Sr. Key or Other Personnel\n(CHOOSE ONE PER ROW)",null,"Type Role for each person in Cells below","Put an X below on each line \nto determine fringe rate \n(CHOOSE ONE PER ROW)",null,null,null,null,null,"Months Devoted to Project",null,null,"Enter Inst. Base Salary","       DOLLAR AMOUNT REQUESTED",null,null,null,null,null,null,null,null,null,null,null,null,null,null,"Data Validation\nRoles on Project"]
["NAME","Sr. Key \nPersonnel","Other \nPersonnel","ROLE ON PROJECT","Faculty","Staff","Wage","Part Time","GRA","Other","Cal. Months","Acad. Months","Sum. Months","INST. BASE SALARY","SALARY \nREQUESTED","FRINGE BENEFITS","TOTAL","CM % Effort","AM % Effort","SM % Effort","Benefit Rate","Summer \nBenefit Rate",null,null,null,null,null,null,null,"PD/PI"]
[null,null,null,null,null,null,null,null,null,null,null,null,null,null,null,null,null,null,null,null,null,"Summer Benefit Rate",null,null,null,null,"Benefit Rates",null,null,"Co-PI"]
[null,null,null,null,null,null,null,null,null,null,{"$f":"R8*12/1","v":0},{"$f":"S8*9/1","v":0},{"$f":"T8*3/1","v":0},0,{"$f":"ROUND(($R8*$N8)+($S8*$N8)+(($N8/9)*(3)*($T8)),0)","v":0},{"$f":"ROUND(IFERROR(IF(AND(K8>0,L8=0,M8=0),W8,IF(AND(K8=0,L8>0,M8=0),X8,IF(AND(K8=0,L8=0,M8>0),Y8,IF(AND(K8=0,L8>0,M8>0),X8+Y8,0)))),0),0)","v":0},{"$f":"ROUND(O8+P8, 0)","v":0},0,0,0,{"$f":"IF(E8=\"X\",$AB$8,IF(F8=\"X\",$AB$9,IF(G8=\"X\",$AB$10,IF(H8=\"X\",$AB$11,IF(I8=\"X\",$AB$12,IF(J8=\"X\",$AB$13,IF(E8=\"\",$AB$12,IF(F8=\"\",$AB$12,IF(G8=\"\",$AB$12,IF(H8=\"\",$AB$12,IF(I8=\"\",$AB$12,IF(J8=\"\",$AB$12))))))))))))","v":0},{"$f":"IF(M8>0, Y3, Y4)","v":0},{"$f":"N8*R8*U8","v":0},{"$f":"N8*S8*U8","v":0},{"$f":"((N8/9*3)*T8)*V8","v":0},null,"Faculty",0.28199999999999997,null,"Co-I"]
[null,null,null,null,null,null,null,null,null,null,0,{"$f":"S9*9/1","v":0},{"$f":"T9*3/1","v":0},0,{"$f":"ROUND(($R9*$N9)+($S9*$N9)+(($N9/9)*(3)*($T9)),0)","v":0},{"$f":"ROUND(IFERROR(IF(AND(K9>0,L9=0,M9=0),W9,IF(AND(K9=0,L9>0,M9=0),X9,IF(AND(K9=0,L9=0,M9>0),Y9,IF(AND(K9=0,L9>0,M9>0),X9+Y9,0)))),0),0)","v":0},{"$f":"ROUND(O9+P9, 0)","v":0},0,0,0,0,{"$f":"IF(M9>0, Y3, Y4)","v":0},{"$f":"N9*R9*U9","v":0},{"$f":"N9*S9*U9","v":0},{"$f":"((N9/9*3)*T9)*V9","v":0},null,"Staff",0.38100000000000001,null,"Res. Asst."]
[null,null,null,null,null,null,null,null,null,null,0,0,0,0,0,0,0,0,0,0,0,{"$f":"IF(M10>0, Y3, Y4)","v":0},0,{"$f":"N10*S10*U10","v":0},{"$f":"((N10/9*3)*T10)*V10","v":0},null,"Wage",7.0000000000000007E-2,null,"Res. Tech."]
[null,null,null,null,null,null,null,null,null,null,0,0,0,0,0,0,0,0,0,0,0,{"$f":"IF(M11>0, Y3, Y4)","v":0},0,0,0,null,"Part time",0.28199999999999997,null,"CRC"]
[null,null,null,null,null,null,null,null,null,null,0,0,0,0,0,0,0,0,0,0,0,{"$f":"IF(M12>0, Y3, Y4)","v":0},0,0,0,null,"GRA",0,null,"Lab Tech."]
[null,null,null,null,null,null,null,null,null,null,0,0,0,0,0,0,0,0,0,0,0,{"$f":"IF(M13>0, Y3, Y4)","v":0},0,0,0,null,"Other",null,null,"Data Analyst"]
[null,null,null,null,null,null,null,null,null,null,0,0,0,0,0,0,0,0,0,0,0,{"$f":"IF(M14>0, Y3, Y4)","v":0},0,0,0,null,null,null,null,"Proj. Cord."]
[null,null,null,null,null,null,null,null,null,null,0,0,0,0,0,0,0,0,0,0,0,{"$f":"IF(M15>0, Y3, Y4)","v":0},0,0,0,null,null,null,null,"Biostatistician"]
{"$rows_left_out":9}
{"sheet":"Sub01","index":3,"n_rows":94,"n_cols":19,"rows_kept":94,"cut":false,"hidden":true,"merged":[[4,0,4,1],[0,1,0,2],[1,1,1,2],[2,0,3,0],[76,0,77,0],[76,1,77,1],[76,2,77,2],[76,8,77,8],[76,9,77,9],[76,10,77,10],[93,0,93,3],[6,0,7,2],[8,0,8,1],[76,3,77,3],[76,15,77,15],[71,1,71,7],[76,11,77,11],[75,1,75,3],[61,4,61,5],[76,4,77,4],[76,5,77,5],[76,13,77,13],[76,14,77,14],[73,10,74,10],[75,4,75,6],[75,8,75,10],[73,0,74,7],[76,12,77,12],[76,6,77,6],[76,7,77,7]]}
["Subaward #1 - Organization Name"]
["Subaward PI:"]
[null,"Budget Period Start Date:",{"$f":"'UVA Overview'!C4","v":"00:00:00"}]
[null,"Budget Period End Date:",{"$f":"'UVA Overview'!E4","v":"00:00:00"}]
["Balance remaining of first $25,000 included in UVA MTDC:"]
[]
["RESEARCH & RELATED BUDGET\n BUDGET FOR NEXT PERIOD"]
[]
[null,null,{"$f":"'UVA Overview'!E7","v":"YEAR "}]
["Senior/Key Personnel (List Sr. Key in Blue Cells Below)","Role",{"$f":"ROUND(SUM(C11:C15),0)","v":0}]
[]
[]
[]
[]
[]
{"$rows_left_out":80}
{"sheet":"Sub02","index":4,"n_rows":94,"n_cols":19,"rows_kept":94,"cut":false,"hidden":true,"merged":[[61,4,61,5],[0,1,0,2],[1,1,1,2],[4,0,4,1],[2,0,3,0],[6,0,7,2],[8,0,8,1],[76,15,77,15],[93,0,93,3],[76,11,77,11],[76,12,77,12],[76,13,77,13],[76,14,77,14],[73,10,74,10],[75,4,75,6],[75,8,75,10],[76,10,77,10],[75,1,75,3],[71,1,71,7],[73,0,74,7],[76,7,77,7],[76,8,77,8],[76,9,77,9],[76,1,77,1],[76,2,77,2],[76,3,77,3],[76,4,77,4],[76,5,77,5],[76,6,77,6],[76,0,77,0]]}
["Subaward #2 - Organization Name"]
["Subaward PI:"]
[null,"Budget Period Start Date:",{"$f":"'UVA Overview'!C4","v":"00:00:00"}]
[null,"Budget Period End Date:",{"$f":"'UVA Overview'!E4","v":"00:00:00"}]
["Balance remaining of first $25,000 included in UVA MTDC:"]
[]
["RESEARCH & RELATED BUDGET\n BUDGET FOR NEXT PERIOD"]
[]
[null,null,{"$f":"'UVA Overview'!E7","v":"YEAR "}]
["Senior/Key Personnel (List Sr. Key in Blue Cells Below)","Role",{"$f":"ROUND(SUM(C11:C15),0)","v":0}]
[]
[]
[]
[]
[]
{"$rows_left_out":80}
{"sheet":"Sub03","index":5,"n_rows":94,"n_cols":19,"rows_kept":94,"cut":false,"hidden":true,"merged":[[4,0,4,1],[6,0,7,2],[61,4,61,5],[0,1,0,2],[1,1,1,2],[2,0,3,0],[8,0,8,1],[76,13,77,13],[76,14,77,14],[76,5,77,5],[76,6,77,6],[76,7,77,7],[76,8,77,8],[76,9,77,9],[71,1,71,7],[76,15,77,15],[93,0,93,3],[76,0,77,0],[73,0,74,7],[73,10,74,10],[75,4,75,6],[75,8,75,10],[76,10,77,10],[75,1,75,3],[76,1,77,1],[76,2,77,2],[76,3,77,3],[76,4,77,4],[76,11,77,11],[76,12,77,12]]}
["Subaward #3 - Organization Name"]
["Subaward PI:"]
[null,"Budget Period Start Date:",{"$f":"IF('UVA Overview'!$C$4=\"\",\"\",'UVA Overview'!$C$4)","v":""}]
[null,"Budget Period End Date:",{"$f":"IF('UVA Overview'!E4=\"\",\"\",'UVA Overview'!E4)","v":""}]
["Balance remaining of first $25,000 included in UVA MTDC:"]
[]
["RESEARCH & RELATED BUDGET\n BUDGET FOR NEXT PERIOD"]
[]
[null,null,{"$f":"'UVA Overview'!E7","v":"YEAR "}]
["Senior/Key Personnel (List Sr. Key in Blue Cells Below)","Role",{"$f":"ROUND(SUM(C11:C15),0)","v":0}]
[]
[]
[]
[]
[]
{"$rows_left_out":80}
{"sheet":"Sub04","index":6,"n_rows":94,"n_cols":19,"rows_kept":94,"cut":false,"hidden":true,"merged":[[61,4,61,5],[0,1,0,2],[4,0,4,1],[2,0,3,0],[6,0,7,2],[1,1,1,2],[8,0,8,1],[76,13,77,13],[76,14,77,14],[76,5,77,5],[76,6,77,6],[76,7,77,7],[76,8,77,8],[76,9,77,9],[71,1,71,7],[76,15,77,15],[93,0,93,3],[76,0,77,0],[73,0,74,7],[73,10,74,10],[75,4,75,6],[75,8,75,10],[76,10,77,10],[75,1,75,3],[76,1,77,1],[76,2,77,2],[76,3,77,3],[76,4,77,4],[76,11,77,11],[76,12,77,12]]}
["Subaward #4 - Organization Name"]
["Subaward PI:"]
[null,"Budget Period Start Date:",{"$f":"IF('UVA Overview'!$C$4=\"\",\"\",'UVA Overview'!$C$4)","v":""}]
[null,"Budget Period End Date:",{"$f":"IF('UVA Overview'!E4=\"\",\"\",'UVA Overview'!E4)","v":""}]
["Balance remaining of first $25,000 included in UVA MTDC:"]
[]
["RESEARCH & RELATED BUDGET\n BUDGET FOR NEXT PERIOD"]
[]
[null,null,{"$f":"'UVA Overview'!E7","v":"YEAR "}]
["Senior/Key Personnel (List Sr. Key in Blue Cells Below)","Role",{"$f":"ROUND(SUM(C11:C15),0)","v":0}]
[]
[]
[]
[]
[]
{"$rows_left_out":80}
{"sheet":"Sub05","index":7,"n_rows":94,"n_cols":19,"rows_kept":94,"cut":false,"hidden":true,"merged":[[61,4,61,5],[0,1,0,2],[2,0,3,0],[4,0,4,1],[6,0,7,2],[1,1,1,2],[8,0,8,1],[76,13,77,13],[76,14,77,14],[76,5,77,5],[76,6,77,6],[76,7,77,7],[76,8,77,8],[76,9,77,9],[71,1,71,7],[76,15,77,15],[93,0,93,3],[76,0,77,0],[73,0,74,7],[73,10,74,10],[75,4,75,6],[75,8,75,10],[76,10,77,10],[75,1,75,3],[76,1,77,1],[76,2,77,2],[76,3,77,3],[76,4,77,4],[76,11,77,11],[76,12,77,12]]}
["Subaward #5 - Organization Name"]
["Subaward PI:"]
[null,"Budget Period Start Date:",{"$f":"IF('UVA Overview'!$C$4=\"\",\"\",'UVA Overview'!$C$4)","v":""}]
[null,"Budget Period End Date:",{"$f":"IF('UVA Overview'!E4=\"\",\"\",'UVA Overview'!E4)","v":""}]
["Balance remaining of first $25,000 included in UVA MTDC:"]
[]
["RESEARCH & RELATED BUDGET\n BUDGET FOR NEXT PERIOD"]
[]
[null,null,{"$f":"'UVA Overview'!E7","v":"YEAR "}]
["Senior/Key Personnel (List Sr. Key in Blue Cells Below)","Role",{"$f":"ROUND(SUM(C11:C15),0)","v":0}]
[]
[]
[]
[]
[]
{"$rows_left_out":80}
{"sheet":"Sub06","index":8,"n_rows":94,"n_cols":19,"rows_kept":94,"cut":false,"hidden":true,"merged":[[76,12,77,12],[75,1,75,3],[0,1,0,2],[4,0,4,1],[2,0,3,0],[61,4,61,5],[6,0,7,2],[1,1,1,2],[8,0,8,1],[76,11,77,11],[73,0,74,7],[73,10,74,10],[75,4,75,6],[75,8,75,10],[76,15,77,15],[93,0,93,3],[71,1,71,7],[76,14,77,14],[76,0,77,0],[76,1,77,1],[76,2,77,2],[76,3,77,3],[76,4,77,4],[76,5,77,5],[76,13,77,13],[76,6,77,6],[76,7,77,7],[76,8,77,8],[76,9,77,9],[76,10,77,10]]}
["Subaward #6 - Organization Name"]
["Subaward PI:"]
[null,"Budget Period Start Date:",{"$f":"IF('UVA Overview'!$C$4=\"\",\"\",'UVA Overview'!$C$4)","v":""}]
[null,"Budget Period End Date:",{"$f":"IF('UVA Overview'!E4=\"\",\"\",'UVA Overview'!E4)","v":""}]
["Balance remaining of first $25,000 included in UVA MTDC:"]
[]
["RESEARCH & RELATED BUDGET\n BUDGET FOR NEXT PERIOD"]
[]
[null,null,{"$f":"'UVA Overview'!E7","v":"YEAR "}]
["Senior/Key Personnel (List Sr. Key in Blue Cells Below)","Role",{"$f":"ROUND(SUM(C11:C15),0)","v":0}]
[]
[]
[]
[]
[]
{"$rows_left_out":80}
{"sheet":"Sub07","index":9,"n_rows":94,"n_cols":19,"rows_kept":94,"cut":false,"hidden":true,"merged":[[76,12,77,12],[75,1,75,3],[0,1,0,2],[4,0,4,1],[61,4,61,5],[2,0,3,0],[1,1,1,2],[6,0,7,2],[8,0,8,1],[76,11,77,11],[73,0,74,7],[73,10,74,10],[75,4,75,6],[75,8,75,10],[76,15,77,15],[93,0,93,3],[71,1,71,7],[76,14,77,14],[76,0,77,0],[76,1,77,1],[76,2,77,2],[76,3,77,3],[76,4,77,4],[76,5,77,5],[76,13,77,13],[76,6,77,6],[76,7,77,7],[76,8,77,8],[76,9,77,9],[76,10,77,10]]}
["Subaward #7 - Organization Name"]
["Subaward PI:"]
[null,"Budget Period Start Date:",{"$f":"IF('UVA Overview'!$C$4=\"\",\"\",'UVA Overview'!$C$4)","v":""}]
[null,"Budget Period End Date:",{"$f":"IF('UVA Overview'!E4=\"\",\"\",'UVA Overview'!E4)","v":""}]
["Balance remaining of first $25,000 included in UVA MTDC:"]
[]
["RESEARCH & RELATED BUDGET\n BUDGET FOR NEXT PERIOD"]
[]
[null,null,{"$f":"'UVA Overview'!E7","v":"YEAR "}]
["Senior/Key Personnel (List Sr. Key in Blue Cells Below)","Role",{"$f":"ROUND(SUM(C11:C15),0)","v":0}]
[]
[]
[]
[]
[]
{"$rows_left_out":80}
{"sheet":"Sub08","index":10,"n_rows":94,"n_cols":19,"rows_kept":94,"cut":false,"hidden":true,"merged":[[76,12,77,12],[75,1,75,3],[61,4,61,5],[0,1,0,2],[2,0,3,0],[4,0,4,1],[6,0,7,2],[1,1,1,2],[8,0,8,1],[76,11,77,11],[73,0,74,7],[73,10,74,10],[75,4,75,6],[75,8,75,10],[76,15,77,15],[93,0,93,3],[71,1,71,7],[76,14,77,14],[76,0,77,0],[76,1,77,1],[76,2,77,2],[76,3,77,3],[76,4,77,4],[76,5,77,5],[76,13,77,13],[76,6,77,6],[76,7,77,7],[76,8,77,8],[76,9,77,9],[76,10,77,10]]}
["Subaward #8 - Organization Name"]
["Subaward PI:"]
[null,"Budget Period Start Date:",{"$f":"IF('UVA Overview'!$C$4=\"\",\"\",'UVA Overview'!$C$4)","v":""}]
[null,"Budget Period End Date:",{"$f":"IF('UVA Overview'!E4=\"\",\"\",'UVA Overview'!E4)","v":""}]
["Balance remaining of first $25,000 included in UVA MTDC:"]
[]
["RESEARCH & RELATED BUDGET\n BUDGET FOR NEXT PERIOD"]
[]
[null,null,{"$f":"'UVA Overview'!E7","v":"YEAR "}]
["Senior/Key Personnel (List Sr. Key in Blue Cells Below)","Role",{"$f":"ROUND(SUM(C11:C15),0)","v":0}]
[]
[]
[]
[]
[]
{"$rows_left_out":80}
{"sheet":"Sub09","index":11,"n_rows":94,"n_cols":19,"rows_kept":94,"cut":false,"hidden":true,"merged":[[0,1,0,2],[1,1,1,2],[2,0,3,0],[4,0,4,1],[6,0,7,2],[76,10,77,10],[76,11,77,11],[61,4,61,5],[8,0,8,1],[73,0,74,7],[73,10,74,10],[75,4,75,6],[75,8,75,10],[75,1,75,3],[76,15,77,15],[93,0,93,3],[71,1,71,7],[76,14,77,14],[76,0,77,0],[76,1,77,1],[76,2,77,2],[76,3,77,3],[76,4,77,4],[76,5,77,5],[76,12,77,12],[76,13,77,13],[76,6,77,6],[76,7,77,7],[76,8,77,8],[76,9,77,9]]}
["Subaward #9 - Organization Name"]
["Subaward PI:"]
[null,"Budget Period Start Date:",{"$f":"IF('UVA Overview'!$C$4=\"\",\"\",'UVA Overview'!$C$4)","v":""}]
[null,"Budget Period End Date:",{"$f":"IF('UVA Overview'!E4=\"\",\"\",'UVA Overview'!E4)","v":""}]
["Balance remaining of first $25,000 included in UVA MTDC:"]
[]
["RESEARCH & RELATED BUDGET\n BUDGET FOR NEXT PERIOD"]
[]
[null,null,{"$f":"'UVA Overview'!E7","v":"YEAR "}]
["Senior/Key Personnel (List Sr. Key in Blue Cells Below)","Role",{"$f":"ROUND(SUM(C11:C15),0)","v":0}]
[]
[]
[]
[]
[]
{"$rows_left_out":80}
{"sheet":"Sub10","index":12,"n_rows":94,"n_cols":19,"rows_kept":94,"cut":false,"hidden":true,"merged":[[76,12,77,12],[75,1,75,3],[61,4,61,5],[1,1,1,2],[0,1,0,2],[4,0,4,1],[2,0,3,0],[6,0,7,2],[8,0,8,1],[76,11,77,11],[73,0,74,7],[73,10,74,10],[75,4,75,6],[75,8,75,10],[76,15,77,15],[93,0,93,3],[71,1,71,7],[76,14,77,14],[76,0,77,0],[76,1,77,1],[76,2,77,2],[76,3,77,3],[76,4,77,4],[76,5,77,5],[76,13,77,13],[76,6,77,6],[76,7,77,7],[76,8,77,8],[76,9,77,9],[76,10,77,10]]}
["Subaward #10 - Organization Name"]
["Subaward PI:"]
[null,"Budget Period Start Date:",{"$f":"IF('UVA Overview'!$C$4=\"\",\"\",'UVA Overview'!$C$4)","v":""}]
[null,"Budget Period End Date:",{"$f":"IF('UVA Overview'!E4=\"\",\"\",'UVA Overview'!E4)","v":""}]
["Balance remaining of first $25,000 included in UVA MTDC:"]
[]
["RESEARCH & RELATED BUDGET\n BUDGET FOR NEXT PERIOD"]
[]
[null,null,{"$f":"'UVA Overview'!E7","v":"YEAR "}]
["Senior/Key Personnel (List Sr. Key in Blue Cells Below)","Role",{"$f":"ROUND(SUM(C11:C15),0)","v":0}]
[]
[]
[]
[]
[]
{"$rows_left_out":80}
{"sheet":"Sub Formulas","index":13,"n_rows":81,"n_cols":17,"rows_kept":81,"cut":false,"hidden":true,"merged":[]}
[]
[null,null,null,null,null,{"$f":"'Sub01'!C5","v":0}]
[null,null,"SUB1",null,"Y1","Y2","Y3","Y4","Y5",null,"SUB1",null,"Y1","Y2","Y3","Y4","Y5"]
[]
[null,null,null,"$/yr",{"$f":"'Sub01'!C70","v":0},{"$f":"'Sub01'!#REF!","v":{"$error":"#REF!"}},{"$f":"'Sub01'!#REF!","v":{"$error":"#REF!"}},{"$f":"'Sub01'!#REF!","v":{"$error":"#REF!"}},{"$f":"'Sub01'!#REF!","v":{"$error":"#REF!"}},null,null,"$/yr",{"$f":"'Sub01'!C52","v":0},{"$f":"'Sub01'!#REF!","v":{"$error":"#REF!"}},{"$f":"'Sub01'!#REF!","v":{"$error":"#REF!"}},{"$f":"'Sub01'!#REF!","v":{"$error":"#REF!"}},{"$f":"'Sub01'!#REF!","v":{"$error":"#REF!"}}]
[null,null,null,"CumTotal",{"$f":"SUM(E5)","v":0},{"$f":"SUM(E5:F5)","v":{"$error":"#REF!"}},{"$f":"SUM(E5:G5)","v":{"$error":"#REF!"}},{"$f":"SUM(E5:H5)","v":{"$error":"#REF!"}},{"$f":"SUM(E5:I5)","v":{"$error":"#REF!"}},null,null,"CumTotal",{"$f":"SUM(M5)","v":0},{"$f":"SUM(M5:N5)","v":{"$error":"#REF!"}},{"$f":"SUM(M5:O5)","v":{"$error":"#REF!"}},{"$f":"SUM(M5:P5)","v":{"$error":"#REF!"}},{"$f":"SUM(M5:Q5)","v":{"$error":"#REF!"}}]
[null,null,null,"Eligible",{"$f":"IF(E5-$F$2>0,$F$2,E5)","v":0},{"$f":"IF(F5>E8,E8,F5)","v":{"$error":"#REF!"}},{"$f":"IF(G5>F8,F8,G5)","v":{"$error":"#REF!"}},{"$f":"IF(H5>G8,G8,H5)","v":{"$error":"#REF!"}},{"$f":"IF(I5>H8,H8,I5)","v":{"$error":"#REF!"}},null,null,"Eligible",{"$f":"IF(M5-$F$2>0,$F$2,M5)","v":0},{"$f":"IF(N5>M8,M8,N5)","v":{"$error":"#REF!"}},{"$f":"IF(O5>N8,N8,O5)","v":{"$error":"#REF!"}},{"$f":"IF(P5>O8,O8,P5)","v":{"$error":"#REF!"}},{"$f":"IF(Q5>P8,P8,Q5)","v":{"$error":"#REF!"}}]
[null,null,null,"Remain",{"$f":"$F$2-E7","v":0},{"$f":"$F$2-SUM(E7:F7)","v":{"$error":"#REF!"}},{"$f":"$F$2-SUM(E7:G7)","v":{"$error":"#REF!"}},{"$f":"$F$2-SUM(E7:H7)","v":{"$error":"#REF!"}},{"$f":"$F$2-SUM(E7:I7)","v":{"$error":"#REF!"}},null,null,"Remain",{"$f":"$F$2-M7","v":0},{"$f":"$F$2-SUM(M7:N7)","v":{"$error":"#REF!"}},{"$f":"$F$2-SUM(M7:O7)","v":{"$error":"#REF!"}},{"$f":"$F$2-SUM(M7:P7)","v":{"$error":"#REF!"}},{"$f":"$F$2-SUM(M7:Q7)","v":{"$error":"#REF!"}}]
[null,null,null,"SS Entry",{"$f":"-E5+E7","v":0},{"$f":"-F5+F7","v":{"$error":"#REF!"}},{"$f":"-G5+G7","v":{"$error":"#REF!"}},{"$f":"-H5+H7","v":{"$error":"#REF!"}},{"$f":"-I5+I7","v":{"$error":"#REF!"}},null,null,"SS Entry",{"$f":"-M5+M7","v":0},{"$f":"-N5+N7","v":{"$error":"#REF!"}},{"$f":"-O5+O7","v":{"$error":"#REF!"}},{"$f":"-P5+P7","v":{"$error":"#REF!"}},{"$f":"-Q5+Q7","v":{"$error":"#REF!"}}]
[null,null,null,null,null,{"$f":"'Sub02'!C5","v":0}]
[null,null,"SUB2",null,"Y1","Y2","Y3","Y4","Y5",null,"SUB2",null,"Y1","Y2","Y3","Y4","Y5"]
[]
[null,null,null,"$/yr",{"$f":"'Sub02'!C70","v":0},{"$f":"'Sub02'!#REF!","v":{"$error":"#REF!"}},{"$f":"'Sub02'!#REF!","v":{"$error":"#REF!"}},{"$f":"'Sub02'!#REF!","v":{"$error":"#REF!"}},{"$f":"'Sub02'!#REF!","v":{"$error":"#REF!"}},null,null,"$/yr",{"$f":"'Sub02'!C52","v":0},{"$f":"'Sub02'!#REF!","v":{"$error":"#REF!"}},{"$f":"'Sub02'!#REF!","v":{"$error":"#REF!"}},{"$f":"'Sub02'!#REF!","v":{"$error":"#REF!"}},{"$f":"'Sub02'!#REF!","v":{"$error":"#REF!"}}]
[null,null,null,"CumTotal",{"$f":"SUM(E13)","v":0},{"$f":"SUM(E13:F13)","v":{"$error":"#REF!"}},{"$f":"SUM(E13:G13)","v":{"$error":"#REF!"}},{"$f":"SUM(E13:H13)","v":{"$error":"#REF!"}},{"$f":"SUM(E13:I13)","v":{"$error":"#REF!"}},null,null,"CumTotal",{"$f":"SUM(M13)","v":0},{"$f":"SUM(M13:N13)","v":{"$error":"#REF!"}},{"$f":"SUM(M13:O13)","v":{"$error":"#REF!"}},{"$f":"SUM(M13:P13)","v":{"$error":"#REF!"}},{"$f":"SUM(M13:Q13)","v":{"$error":"#REF!"}}]
[null,null,null,"Eligible",{"$f":"IF(E13-$F$10>0,$F$10,E13)","v":0},{"$f":"IF(F13>E16,E16,F13)","v":{"$error":"#REF!"}},{"$f":"IF(G13>F16,F16,G13)","v":{"$error":"#REF!"}},{"$f":"IF(H13>G16,G16,H13)","v":{"$error":"#REF!"}},{"$f":"IF(I13>H16,H16,I13)","v":{"$error":"#REF!"}},null,null,"Eligible",{"$f":"IF(M13-$F$2>0,$F$2,M13)","v":0},{"$f":"IF(N13>M16,M16,N13)","v":{"$error":"#REF!"}},{"$f":"IF(O13>N16,N16,O13)","v":{"$error":"#REF!"}},{"$f":"IF(P13>O16,O16,P13)","v":{"$error":"#REF!"}},{"$f":"IF(Q13>P16,P16,Q13)","v":{"$error":"#REF!"}}]
{"$rows_left_out":66}